אוהד אשל- צמיחה עסקית לחברות וארגונים

yarn command not found

Enter any yarn command you want. 2:46:20 PM: ❯ Context 2:46:20 PM: Started saving build plugins In the file, it will look for the start field under scripts, and run whatever the command defined there is. Upgrade to chokidar 3 with 15x less dependencies. yarn run env. levlaz. js --content-base public /--progress --colors sh: webpack-dev-server: command not found npm ERR! Just change your username on your system. How to install Yarn? 2:46:20 PM: Error location 2:46:20 PM: Started saving boot dependencies 2:44:59 PM: Different publish path detected, going to use the one specified in the Netlify configuration file: ‘client/build’ versus ‘’ in the Netlify UI 2:46:20 PM: ──────────────────────────────────────────────────────────────── 2:46:20 PM: bash: yarn: command not found 2:46:15 PM: npm WARN notsup SKIPPING OPTIONAL DEPENDENCY: Unsupported platform for fsevents<@>1.2.13: wanted {“os”:“darwin”,“arch”:“any”} (current: {“os”:“linux”,“arch”:“x64”}) 2:45:28 PM: npm WARN deprecated har-validator<@>5.1.5: this library is no longer supported Paste the path to NPM folder in your AppData. 2:46:17 PM: Installing missing commands 2:46:20 PM: Finished saving node modules bash: line 1: ng: command not found ng test --watch=false returned exit code 127 angular-cli is listed as a devDependency in the package.json, so the yarn command itself should install it, just as the npm install did with npm, right? “concurrently”: “^5.3.0” ignore = “git diff --quiet HEAD^ HEAD .” 2:46:20 PM: ──────────────────────────────────────────────────────────────── But for anyone else facing the problem, until its fixed. 2:46:15 PM: npm WARN <@>material-ui/styles<@>4.11.1 requires a peer of react-dom<@>^16.8.0 but none is installed. “devDependencies”: { 2:46:20 PM: Started saving node modules Your show hidden files option must … I’m not sure why yarn build command is the problem, but it works fine on my local terminal and that’s the command I use normally. Add this to your profile: export PATH="$PATH:/opt/yarn-[version]/bin" (the path may vary depending on … 2:46:20 PM: ignore: git diff --quiet HEAD^ HEAD . Although a classic command like npm install -g yarn can be used for installation, the Yarn team advises against it: it provides separate installation methods for various operating systems. So I was using - yarn (the latest being 1.22.10) - node v14.15.1 <- the LTS one . For the records deploy works many time and you can check this on callbetter.netlify.app, today I pushed some changes on master branch and noticed that deploy does not pass even that it earlier did many times with the same configuration, 2:44:50 PM: Build ready to start 2:46:15 PM: npm WARN notistack<@>1.0.2 requires a peer of react<@>^16.8.0 but none is installed. “eslint-plugin-jsx-a11y”: “^6.4.1”, I am trying to install Yarn in my Ubuntu system. “client”, If you want to override this command, you can do so by defining your own "env" script in package.json. file sh npm ERR! 2:46:15 PM: npm WARN <@>material-ui/icons<@>5.0.0-alpha.4 requires a peer of <@>material-ui/core<@>^5.0.0-alpha.1 but none is installed. I did check every possible path coming to my mind within RM (SDK, node, npm/yarn), all of them seem correct. Support for Macbook Pro Touch Bar. After installing yarn on my machine i noticed that the command was not found because the content was installed on C:\Program Files (x86)\Yarn\bin, but PATH was set to be under User AppData folder, manually setting the environment variable fixed the issue. 4. Upgrading dependency # 2:44:57 PM: Finished fetching cache in 4.648271539s 2:46:20 PM: Build failed due to a user error: Build script returned non-zero exit code: 2 } Scoop can be installed using the information found at the scoop website. 2:46:20 PM: 1. build.command from netlify.toml 2:46:20 PM: redirects: We're using default node:8 image. 2:46:20 PM: mode: buildbot 2:46:15 PM: npm WARN <@>material-ui/system<@>4.9.14 requires a peer of react-dom<@>^16.8.0 but none is installed. 2:46:20 PM: Started saving go dependencies Once you've followed the instructions (running yarn --version from your home directory should yield something like 1.22.0), go to the next section to see how to actually enable Yarn 2 on your project.. You've probably remarked the global Yarn is from the "Classic" line (1.x). You must install peer dependencies yourself. “eslint-config-prettier”: “^6.15.0”, 2:44:59 PM: Detected ignore command in Netlify configuration file. 2:45:26 PM: npm WARN deprecated <@>hapi/hoek<@>8.5.1: This version has been deprecated and is no longer supported or maintained This should be fixed shortly, and you can follow here for more information: https://t.co/cXP5ntT97h If we execute the same command as above as the user 'user1' we should get the following output if … 2:44:52 PM: build-image tag: v3.5.0 “version”: “1.0.0”, “server” Basically normally doing Ruby, I have to use Rails for a project, and face, again, the same kind of weird path issue (I say path cos' it's probably that...). “eslint-config-vazco”: “^5.3.1”, 2:46:20 PM: ​ In the example below the application was submitted by user1. “ts-node-dev”: “^1.0.0”, 2:46:20 PM: Finished saving build plugins image: node:8 pipelines: default:-step: caches:-node script:-yarn install-yarn run flow-yarn run build-yarn run test --coverage --no-cache. 2:46:17 PM: go version go1.14.4 linux/amd64 Does anything changed between 10AM and 12PM - last success build on the same pipelines config was at 10:20AM “build:server”: “yarn workspace server build”, status = 200, Powered by Discourse, best viewed with JavaScript enabled. Type “control sysdm.cpl,,3” and press enter 3. 2:46:12 PM: > core-js<@>3.8.0 postinstall /opt/build/repo/client/node_modules/core-js 2:46:20 PM: Started saving pip cache 2:46:20 PM: Finished processing build request in 1m28.483980855s. 2:46:20 PM: ──────────────────────────────────────────────────────────────── “husky”: { “eslint-plugin-react”: “^7.21.5”, 2:46:20 PM: Netlify Build 2:45:07 PM: Using ruby version 2.7.1 Fix the issue and everybody wins. Otherwise, only the specified packages are updated. Running this command will list environment variables available to the scripts at runtime. On my local machine, yarn global add will save files under C:\Users\dance2die\AppData\Roaming\npm\bin. 6. If Yarn is not found in your PATH, follow these steps to add it and allow it to be run from anywhere. 2:46:20 PM: command: yarn build 2:44:52 PM: Starting to download cache of 94.4MB You must install peer dependencies yourself. If your build is failing with a `yarn: command not found` error, it is likely due to a current upstream issue. Proceeding with the specified command: ‘git diff --quiet HEAD^ HEAD .’ … 0 npm ERR! You should commit this file. “start:dockerCompose”: “docker-compose up”, Using `/bin/sh` as startup shell sounds pretty sane but then you cannot expect the environment to be the same as the bash/zsh/xxxsh shell the user actually uses, meaning that RM should recreate an environment when executing commands generated from its settings (in that case prepend the path entered in the RM settings for node to the PATH environment variable before executing external commands). 2:46:20 PM: ​ 2:46:17 PM: Finished restoring cached go cache “workspaces”: [ I think I came to the root of the problem. To obtain yarn logs for an application the 'yarn logs' command must be executed as the user that submitted the application. The binary will run within the current cwd. 2:46:17 PM: NPM modules installed info Visit https://yarnpkg.com/en/docs/cli/run for documentation about this command. I launched RubyMine via desktop shortcut (the script run a command like Exec="path_to/rubymine.sh"), but I solved the issue by running "sudo npm i -g yarn" I know that it's not a good practice to install npm package with sudo but for the moment it's ok for me. 2:46:12 PM: > node -e “try{require(’./postinstall’)}catch(e){}” just to be sure, in case you launch RubyMine from the terminal does it work? We need to add that path to Windows Environment Variable Path so that Windows command line interpreter (cmd.exe or powershell.exe) can search the path to find command to run.Now copy that path to clipboard (e.g. yarn -v 1.15.2. Select the path and click Edit. Darwin 14.4. command = “yarn build” 2:46:20 PM: ❯ Config file You must install peer dependencies yourself. My solution was a bit hacky and definitely NOT the way that i think it should be done. () } Of course, you can also do that from the command line in the built-in Terminal. This is for the Linux version but I guess the issue/resolution is almost the same for other platforms. 2:46:20 PM: Failed during stage ‘building site’: Build script returned non-zero exit code: 2 “hooks”: { 2:46:20 PM: ❯ Current directory If you do not specify a script to the yarn run command, the run command will list all of the scripts available to run for a package. 7. 2:46:20 PM: commandOrigin: config 2:46:12 PM: > core-js<@>2.6.12 postinstall /opt/build/repo/client/node_modules/babel-runtime/node_modules/core-js Fast, reliable, and secure dependency management. argv "node" "/usr/local/bin/npm" "run" "devserve" npm ERR! 2:46:15 PM: npm WARN <@>material-ui/core<@>4.11.0 requires a peer of react-dom<@>^16.8.0 but none is installed. 2:45:00 PM: Starting build script “main”: “index.js”, 2:45:27 PM: npm WARN deprecated resolve-url<@>0.2.1: This is expected! In order to solve this problem, you should add the Vue path to your environment variable manually. 2:45:28 PM: npm WARN deprecated request-promise-native<@>1.0.9: request-promise-native has been deprecated because it extends the now deprecated request package, see “scripts”: { “name”: “callbetter”, 2:46:15 PM: npm WARN optional SKIPPING OPTIONAL DEPENDENCY: fsevents<@>^1.2.7 (node_modules/webpack-dev-server/node_modules/chokidar/node_modules/fsevents): 2:46:15 PM: npm WARN notistack<@>1.0.2 requires a peer of react-dom<@>^16.8.0 but none is installed. 2:45:22 PM: npm WARN deprecated <@>hapi/joi<@>15.1.1: Switch to ‘npm install joi’ 2:45:09 PM: npm WARN deprecated <@>types/date-fns<@>2.6.0: This is a stub types definition for date-fns date-fns provides its own type definitions, so you don’t need <@>types/date-fns installed! 2:45:26 PM: npm WARN deprecated <@>hapi/bourne<@>1.3.2: This version has been deprecated and is no longer supported or maintained This worked. “start:dockerServer”: " docker run -e MONGO_PASSWORD=callbetterAdmin -p 5000:5000 -d callbetter:server", 2:44:57 PM: Starting to prepare the repo for build Explorer context menu. 2:45:28 PM: npm WARN deprecated request<@>2.88.2: request has been deprecated, see Please use <@>rollup/plugin-babel. So that or any other solution ensuring the path is correctly set before starting RM will fix the issue. yarn publish [tag] yarn run